Target
E3 ubiquitin-protein ligase SMURF1 [420-757]
Ligand
BDBM238974
Substrate
Meas. Tech.
Biochemical Assay
Temperature
298.15±n/a K
IC50
4400±n/a nM
Comments
extracted
Citation
 Edwards, AAhmed, MPulz, RARooney, LASmith, NTroxler, TJ Carboxamide derivatives US Patent  US9403833 Publication Date 8/2/2016 
Target
Name:
E3 ubiquitin-protein ligase SMURF1 [420-757]
Synonyms:
HECT-type E3 ubiquitin transferase SMURF1 SMUF1_HUMAN | SMURF1
Type:
Enzyme
Mol. Mass.:
39188.96
Organism:
Homo sapiens (Human)
Description:
HECTdomain amino acid 420-757
Residue:
338
  
Inhibitor
Name:
BDBM238974
Synonyms:
US9403833, 9
Type:
Small organic molecule
Emp. Form.:
C22H17ClF4N6O3
Mol. Mass.:
524.855
SMILES:
Cc1c(nnn1-c1ccc(OC(F)(F)F)cc1Cl)C(=O)Nc1c(C)n(C)n(-c2ccccc2F)c1=O
: