Target
Cannabinoid receptor 1
Ligand
BDBM86515
Substrate
Meas. Tech.
[35S]GTPγS Binding Assay
Temperature
303.15±n/a K
EC50
77±29.9 nM
Comments
extracted
Citation
 Prather, PLPrisinzano, TEFantegrossi, WEBrents, LKMoran, JRadominska-Pandya, AVasiljevik, T Use of the aminoalkylindole JWH-073-M4 and related compounds as neutral CB1 receptor antagonists for the treatment of alcoholism, drug abuse, obesity, and obesity-related diseases US Patent  US9416103 Publication Date 8/16/2016 
Target
Name:
Cannabinoid receptor 1
Synonyms:
Brain-type cannabinoid receptor CB-R CNR1_MOUSE Cannabinoid receptor | Cnr1
Type:
Enzyme
Mol. Mass.:
52842.52
Organism:
Mus musculus (Mouse)
Description:
P47746
Residue:
473
  
Inhibitor
Name:
BDBM60994
Synonyms:
(10R,10aR)-6,6,9-Trimethyl-3-pentyl-6a,7,8,10a-tetrahydro-6H-benzo[c]chromen-1-ol 1N-[2-(5-dimethylaminomethyl-2-furylmethylsulfanyl)ethyl]-1N-methyl-2-nitro-(Z)-1-ethene-1,1-diamine 6,6,9-Trimethyl-3-pentyl-6a,7,8,10a-tetrahydro-6H-benzo[c]chromen-1-ol(DeltaE-9-THC) 8,8-Dimethyl-11-methylene-5-pentyl-3,4,8a,9,10,11,12,12a-octahydro-2H,8H-1,7-dioxa-benzo[c]phenanthrene BDBM50007391 DRONABINOL Tetrahydrocannabinol delta-9-THC delta-9-Tetrahydrocannabinol (THC) delta9-tetrahydrocannabinol
Type:
Emp. Form.:
C21H30O2
Mol. Mass.:
314.4617
SMILES:
CCCCCc1cc(O)c2[C@@H]3C=C(C)CC[C@H]3C(C)(C)Oc2c1
: