Target
Cannabinoid receptor 1
Ligand
BDBM239078
Substrate
Meas. Tech.
Functional Assay
Ki
1.7±0.3 nM
Citation
 Prather, PLPrisinzano, TEFantegrossi, WEBrents, LKMoran, JRadominska-Pandya, AVasiljevik, T Use of the aminoalkylindole JWH-073-M4 and related compounds as neutral CB1 receptor antagonists for the treatment of alcoholism, drug abuse, obesity, and obesity-related diseases US Patent  US9416103 Publication Date 8/16/2016 
Target
Name:
Cannabinoid receptor 1
Synonyms:
Brain-type cannabinoid receptor CB-R CNR1_MOUSE Cannabinoid receptor | Cnr1
Type:
Enzyme
Mol. Mass.:
52842.52
Organism:
Mus musculus (Mouse)
Description:
P47746
Residue:
473
  
Inhibitor
Name:
BDBM239078
Synonyms:
US9416103, TV-5-157
Type:
Small organic molecule
Emp. Form.:
C24H23NO2
Mol. Mass.:
357.4449
SMILES:
CCCCn1cc(C(=O)c2cccc3ccccc23)c2cccc(OC)c12
: