Target
Cannabinoid receptor 1
Ligand
BDBM239079
Substrate
Meas. Tech.
Functional Assay
Ki
37.3±11.8 nM
Citation
 Prather, PLPrisinzano, TEFantegrossi, WEBrents, LKMoran, JRadominska-Pandya, AVasiljevik, T Use of the aminoalkylindole JWH-073-M4 and related compounds as neutral CB1 receptor antagonists for the treatment of alcoholism, drug abuse, obesity, and obesity-related diseases US Patent  US9416103 Publication Date 8/16/2016 
Target
Name:
Cannabinoid receptor 1
Synonyms:
Brain-type cannabinoid receptor CB-R CNR1_MOUSE Cannabinoid receptor | Cnr1
Type:
Enzyme
Mol. Mass.:
52842.52
Organism:
Mus musculus (Mouse)
Description:
P47746
Residue:
473
  
Inhibitor
Name:
BDBM239079
Synonyms:
US9416103, TV-6-41
Type:
Small organic molecule
Emp. Form.:
C23H23NO
Mol. Mass.:
329.4348
SMILES:
CCCCn1cc(-c2cccc3ccccc23)c2cccc(OC)c12
: