Target
Leucine-rich repeat serine/threonine-protein kinase 2 [970-2527]
Ligand
BDBM239521
Substrate
Meas. Tech.
LanthaScreen™ Assay (Km ATP)
pH
8.5±n/a
Temperature
298.15±n/a K
IC50
7.08±n/a nM
Comments
extracted
Citation
 Miller, MBasu, KDeMong, DScott, JLi, WHarris, JStamford, APoirier, MTempest, P Compounds inhibiting leucine-rich repeat kinase enzyme activity US Patent  US9416126 Publication Date 8/16/2016 
Target
Name:
Leucine-rich repeat serine/threonine-protein kinase 2 [970-2527]
Synonyms:
LRRK2 Leucine-rich repeat kinase 2 (LRRK2 t-WT) PARK8
Type:
Protein
Mol. Mass.:
177317.56
Organism:
Homo sapiens (Human)
Description:
Human LRRK2 variant (970-2527aa)
Residue:
1558
  
Inhibitor
Name:
BDBM239521
Synonyms:
US9416126, U5
Type:
Small organic molecule
Emp. Form.:
C24H25F2N5O
Mol. Mass.:
437.485
SMILES:
CC1(C)CC(=O)C=C(C1)c1ccc2[nH]nc(-c3cc(ncn3)N3CCC(F)(F)CC3)c2c1
: