Target
Cannabinoid receptor 2
Ligand
BDBM240047
Substrate
Meas. Tech.
cAMP Assay
Temperature
310.15±n/a K
EC50
178±n/a nM
Comments
extracted
Citation
 Bissantz, CDhurwasulu, BGrether, UHazra, AHebeisen, PRoever, SRogers-Evans, M Pyrazine derivatives US Patent  US9403808 Publication Date 8/2/2016 
Target
Name:
Cannabinoid receptor 2
Synonyms:
CANNABINOID CB2 CB2 CB2B CNR2_HUMAN Cannabinoid CB2 receptor Cannabinoid receptor 2 (CB2R) | hCB2
Type:
G Protein-Coupled Receptor (GPCR)
Mol. Mass.:
39690.94
Organism:
Homo sapiens (Human)
Description:
P34972
Residue:
360
  
Inhibitor
Name:
BDBM240047
Synonyms:
US9403808, 58
Type:
Small organic molecule
Emp. Form.:
C17H21F2N7O3
Mol. Mass.:
409.3905
SMILES:
CC(C)(NC(=O)c1cnc(N2CC(F)(F)C2)c(OCC2CC2)n1)c1noc(N)n1
: