Target
Cannabinoid receptor 1
Ligand
BDBM240047
Substrate
Meas. Tech.
cAMP Assay
Temperature
310.15±n/a K
EC50
>10000±n/a nM
Comments
extracted
Citation
 Bissantz, CDhurwasulu, BGrether, UHazra, AHebeisen, PRoever, SRogers-Evans, M Pyrazine derivatives US Patent  US9403808 Publication Date 8/2/2016 
Target
Name:
Cannabinoid receptor 1
Synonyms:
CANN6 CB-R CNR CNR1_HUMAN Cannabinoid receptor Cannabinoid receptor 1 (brain)
Type:
G Protein-Coupled Receptor (GPCR)
Mol. Mass.:
52868.96
Organism:
Homo sapiens (Human)
Description:
P21554
Residue:
472
  
Inhibitor
Name:
BDBM240047
Synonyms:
US9403808, 58
Type:
Small organic molecule
Emp. Form.:
C17H21F2N7O3
Mol. Mass.:
409.3905
SMILES:
CC(C)(NC(=O)c1cnc(N2CC(F)(F)C2)c(OCC2CC2)n1)c1noc(N)n1
: