Target
Orexin receptor type 2
Ligand
BDBM240114
Substrate
Meas. Tech.
Intracellular Calcium Assay
Temperature
310.15±n/a K
IC50
5±n/a nM
Comments
extracted
Citation
 Bolli, MBoss, CBrotschi, CHeidmann, BSifferlen, TWilliams, JT Azetidine amide derivatives as orexin receptor antagonists US Patent  US9403813 Publication Date 8/2/2016 
Target
Name:
Orexin receptor type 2
Synonyms:
HCRTR2 OX2R_HUMAN Orexin receptor type 2 (OR-2) Orexin receptor type 2 (OX2R) Ox-2-R | Ox2-R
Type:
Protein
Mol. Mass.:
50710.53
Organism:
Homo sapiens (Human)
Description:
O43614
Residue:
444
  
Inhibitor
Name:
BDBM240114
Synonyms:
US9403813, 18
Type:
Small organic molecule
Emp. Form.:
C23H19F3N6O3
Mol. Mass.:
484.4306
SMILES:
Cc1cc(C(=O)N2CC[C@H]2c2nc(no2)-c2ccccc2OC(F)(F)F)c(cc1C)-n1nccn1
: