Target
Orexin receptor type 2
Ligand
BDBM240177
Substrate
Meas. Tech.
Intracellular Calcium Assay
Temperature
310.15±n/a K
IC50
10±n/a nM
Comments
extracted
Citation
 Bolli, MBoss, CBrotschi, CHeidmann, BSifferlen, TWilliams, JT Azetidine amide derivatives as orexin receptor antagonists US Patent  US9403813 Publication Date 8/2/2016 
Target
Name:
Orexin receptor type 2
Synonyms:
HCRTR2 OX2R_HUMAN Orexin receptor type 2 (OR-2) Orexin receptor type 2 (OX2R) Ox-2-R | Ox2-R
Type:
Protein
Mol. Mass.:
50710.53
Organism:
Homo sapiens (Human)
Description:
O43614
Residue:
444
  
Inhibitor
Name:
BDBM240177
Synonyms:
US9403813, 82
Type:
Small organic molecule
Emp. Form.:
C22H18Cl2N6O2
Mol. Mass.:
469.323
SMILES:
Cc1cc(c(cc1Cl)C(=O)N1CC[C@H]1c1nc(no1)-c1cccc(Cl)c1C)-n1nccn1
: