Target
Orexin receptor type 2
Ligand
BDBM240194
Substrate
Meas. Tech.
Intracellular Calcium Assay
Temperature
310.15±n/a K
IC50
1±n/a nM
Comments
extracted
Citation
 Bolli, MBoss, CBrotschi, CHeidmann, BSifferlen, TWilliams, JT Azetidine amide derivatives as orexin receptor antagonists US Patent  US9403813 Publication Date 8/2/2016 
Target
Name:
Orexin receptor type 2
Synonyms:
HCRTR2 OX2R_HUMAN Orexin receptor type 2 (OR-2) Orexin receptor type 2 (OX2R) Ox-2-R | Ox2-R
Type:
Protein
Mol. Mass.:
50710.53
Organism:
Homo sapiens (Human)
Description:
O43614
Residue:
444
  
Inhibitor
Name:
BDBM240194
Synonyms:
US9403813, 99
Type:
Small organic molecule
Emp. Form.:
C22H20ClN7O3
Mol. Mass.:
465.892
SMILES:
CCOc1ncccc1-c1nc(no1)[C@@H]1CCN1C(=O)c1cc(Cl)c(C)cc1-n1nccn1
: