Target
Prostaglandin E2 receptor EP1 subtype
Ligand
BDBM240746
Substrate
Meas. Tech.
Cell Based Assay
pH
7.4±n/a
Temperature
310.15±n/a K
EC50
63±n/a nM
Comments
extracted
Citation
 Martos, JLCarling, WRWoodward, DFWang, JWKangasmetsa, JJ Compounds act at multiple prostaglandin receptors giving a general anti-inflammatory response US Patent  US9422273 Publication Date 8/23/2016 
Target
Name:
Prostaglandin E2 receptor EP1 subtype
Synonyms:
PE2R1_HUMAN PTGER1 Prostaglandin E2 receptor EP1 subtype Prostanoid EP1 receptor
Type:
Enzyme
Mol. Mass.:
41834.57
Organism:
Homo sapiens (Human)
Description:
P34995
Residue:
402
  
Inhibitor
Name:
BDBM240746
Synonyms:
US9422273, 12d
Type:
Small organic molecule
Emp. Form.:
C30H39F3N4O7S
Mol. Mass.:
656.713
SMILES:
FC(F)(F)S(=O)(=O)NC(=O)CCc1cc2OCOc2cc1CN1CCC[C@H]1c1nc(co1)C(=O)NCCCCC1CCCCC1
: