Target
Plasminogen
Ligand
BDBM240793
Substrate
Meas. Tech.
Plasmin Amidolytic Assay
pH
7.4±n/a
Ki
7700±700 nM
Comments
extracted
Citation
 Markowska, ABruzgo, MSurazynski, AMidura-Nowaczek, K Tripeptides with non-code amino acids as potential serine proteases inhibitors. J Enzyme Inhib Med Chem 28:639-43 (2013)  
Target
Name:
Plasminogen
Synonyms:
Activation peptide PLG Plasmin Plasmin heavy chain A, short form | Plasmin light chain B
Type:
Enzyme
Mol. Mass.:
90579.18
Organism:
Homo sapiens (Human)
Description:
Residue:
810
  
Inhibitor
Name:
BDBM240793
Synonyms:
H-D-Ser-Chg-Arg-OH (4)
Type:
Small organic molecule
Emp. Form.:
C18H34N6O5
Mol. Mass.:
414.4998
SMILES:
N[C@H](CO)C(=O)N[C@@H](CC(=O)N[C@H](CCCNC(N)=N)C(O)=O)C1CCCCC1
: