Target
Plasminogen
Ligand
BDBM240796
Substrate
Meas. Tech.
Plasmin Amidolytic Assay
pH
7.4±n/a
Ki
7900±700 nM
Comments
extracted
Citation
 Markowska, ABruzgo, MSurazynski, AMidura-Nowaczek, K Tripeptides with non-code amino acids as potential serine proteases inhibitors. J Enzyme Inhib Med Chem 28:639-43 (2013)  
Target
Name:
Plasminogen
Synonyms:
Activation peptide PLG Plasmin Plasmin heavy chain A, short form | Plasmin light chain B
Type:
Enzyme
Mol. Mass.:
90579.18
Organism:
Homo sapiens (Human)
Description:
Residue:
810
  
Inhibitor
Name:
BDBM240796
Synonyms:
H-D-Ser-αMePhe-Arg-OH (7)
Type:
Small organic molecule
Emp. Form.:
C20H32N6O4
Mol. Mass.:
420.5059
SMILES:
CC[C@@H](N)C(=O)N[C@@](C)(Cc1ccccc1)C(=O)N[C@H](CCCNC(N)=N)C(O)=O
: