Target
E3 ubiquitin-protein ligase XIAP [124-240]
Ligand
BDBM240892
Substrate
Meas. Tech.
TR-FRET Assay
pH
7.5±n/a
Temperature
298.15±n/a K
IC50
0.325±n/a nM
Comments
extracted
Citation
 Mischke, SG Dimeric compounds US Patent  US9409888 Publication Date 8/9/2016 
Target
Name:
E3 ubiquitin-protein ligase XIAP [124-240]
Synonyms:
API3 Baculoviral IAP repeat-containing protein 2 (BIR2) E3 ubiquitin-protein ligase XIAP BIR2 XIAP XIAP_HUMAN
Type:
Protein
Mol. Mass.:
13562.46
Organism:
Artificial Sequence
Description:
TR-FRET peptide Corresponds to amino acids 124-240 of human XIAP.
Residue:
117
  
Inhibitor
Name:
BDBM240892
Synonyms:
US9409888, 19
Type:
Small organic molecule
Emp. Form.:
C56H54Br2N10O8
Mol. Mass.:
1154.898
SMILES:
CN[C@@H](C)C(=O)N[C@H]1CN(C(=O)c2cnc(cn2)C(=O)N2C[C@H](NC(=O)[C@H](C)NC)C(=O)N(Cc3c(OC)ccc4cc(Br)ccc34)c3ccccc23)c2ccccc2N(Cc2c(OC)ccc3cc(Br)ccc23)C1=O
: