Target
Coagulation factor IX
Ligand
BDBM241555
Substrate
US9409908, pyroGlu-Pro-Arg-pNA
Meas. Tech.
In Vitro Assay
pH
7.4±n/a
Ki
0.44±n/a nM
Comments
extracted
Citation
 Yang, WCorte, JRGilligan, PJPinto, DJEwing, WRDilger, AKWang, YFang, TPabbisetty, KBSmith, II, LM Dihydropyridone p1 as factor XIa inhibitors US Patent  US9409908 Publication Date 8/9/2016 
Target
Name:
Coagulation factor IX
Synonyms:
Christmas factor Coagulation factor IX/VIII Coagulation factor IXa heavy chain F9 Factor IX Factor IXa (fIXa) Plasma thromboplastin component
Type:
Enzyme
Mol. Mass.:
51768.83
Organism:
Homo sapiens (Human)
Description:
P00740
Residue:
461
  
Inhibitor
Name:
BDBM241555
Synonyms:
US9409908, 187 | US9951071, Example 187
Type:
Small organic molecule
Emp. Form.:
C31H26ClF4N3O4
Mol. Mass.:
616.002
SMILES:
C[C@@H]1CCC[C@H](N2CCC(=CC2=O)c2c(F)c(Cl)ccc2C(F)(F)F)c2cc(ccn2)-c2cc(ccc2NC1=O)C(O)=O
:
Substrate
Name:
BDBM13573
Synonyms:
(2S)-5-carbamimidamido-N-(4-nitrophenyl)-2-{[(2S)-1-{[(2S)-5-oxopyrrolidin-2-yl]carbonyl}pyrrolidin-2-yl]formamido}pentanamide hydrochloride Glu-Pro-Arg-pNA L-Pyroglutamyl-L-prolyl-L-arginine-p-Nitroaniline S-2366
Type:
Small organic molecule
Emp. Form.:
C22H30N8O6
Mol. Mass.:
502.5236
SMILES:
[#7]\[#6](-[#7])=[#7]/[#6]-[#6]-[#6]-[#6@H](-[#7]-[#6](=O)-[#6@@H]-1-[#6]-[#6]-[#6]-[#7]-1-[#6](=O)-[#6@@H]-1-[#6]-[#6]-[#6](=O)-[#7]-1)-[#6](=O)-[#7]-c1ccc(cc1)-[#7+](-[#8-])=O
: