Target
Cannabinoid receptor 2
Ligand
BDBM242433
Substrate
Meas. Tech.
Binding Assay
Temperature
303.15±n/a K
Ki
84±n/a nM
IC50
179±n/a nM
Comments
extracted
Citation
 Yacovan, AAlroy, IAizikovich, AMirilashvili, SGrynszpan, F Sulfonamide derivatives with therapeutic indications US Patent  US9422235 Publication Date 8/23/2016 
Target
Name:
Cannabinoid receptor 2
Synonyms:
CANNABINOID CB2 CB2 CB2B CNR2_HUMAN Cannabinoid CB2 receptor Cannabinoid receptor 2 (CB2R) | hCB2
Type:
G Protein-Coupled Receptor (GPCR)
Mol. Mass.:
39690.94
Organism:
Homo sapiens (Human)
Description:
P34972
Residue:
360
  
Inhibitor
Name:
BDBM242433
Synonyms:
US9422235, 6
Type:
Small organic molecule
Emp. Form.:
C18H19F3N2O3S
Mol. Mass.:
400.415
SMILES:
COc1ccc(Nc2ccc(c(c2)C(F)(F)F)S(=O)(=O)NCC2CC2)cc1
: