Target
Cannabinoid receptor 2
Ligand
BDBM242438
Substrate
Meas. Tech.
Binding Assay
Temperature
303.15±n/a K
Ki
6±n/a nM
IC50
11±n/a nM
Comments
extracted
Citation
 Yacovan, AAlroy, IAizikovich, AMirilashvili, SGrynszpan, F Sulfonamide derivatives with therapeutic indications US Patent  US9422235 Publication Date 8/23/2016 
Target
Name:
Cannabinoid receptor 2
Synonyms:
CANNABINOID CB2 CB2 CB2B CNR2_HUMAN Cannabinoid CB2 receptor Cannabinoid receptor 2 (CB2R) | hCB2
Type:
G Protein-Coupled Receptor (GPCR)
Mol. Mass.:
39690.94
Organism:
Homo sapiens (Human)
Description:
P34972
Residue:
360
  
Inhibitor
Name:
BDBM242438
Synonyms:
US9422235, 12
Type:
Small organic molecule
Emp. Form.:
C18H22N2O4S
Mol. Mass.:
362.443
SMILES:
COc1cc(Nc2ccc(cc2)S(=O)(=O)NCC2CC2)cc(OC)c1
: