Target
Cannabinoid receptor 2
Ligand
BDBM242479
Substrate
Meas. Tech.
Binding Assay
Temperature
303.15±n/a K
Ki
175±n/a nM
IC50
327±n/a nM
Comments
extracted
Citation
 Yacovan, AAlroy, IAizikovich, AMirilashvili, SGrynszpan, F Sulfonamide derivatives with therapeutic indications US Patent  US9422235 Publication Date 8/23/2016 
Target
Name:
Cannabinoid receptor 2
Synonyms:
CANNABINOID CB2 CB2 CB2B CNR2_HUMAN Cannabinoid CB2 receptor Cannabinoid receptor 2 (CB2R) | hCB2
Type:
G Protein-Coupled Receptor (GPCR)
Mol. Mass.:
39690.94
Organism:
Homo sapiens (Human)
Description:
P34972
Residue:
360
  
Inhibitor
Name:
BDBM242479
Synonyms:
US9422235, 57
Type:
Small organic molecule
Emp. Form.:
C18H17Cl2F3N2O2S
Mol. Mass.:
453.306
SMILES:
CN(CC1CC1)S(=O)(=O)c1ccc(Nc2ccc(Cl)cc2Cl)cc1C(F)(F)F
: