Target
Cannabinoid receptor 2
Ligand
BDBM242492
Substrate
Meas. Tech.
Binding Assay
Temperature
303.15±n/a K
Ki
43.27±n/a nM
IC50
95.6±n/a nM
Comments
extracted
Citation
 Yacovan, AAlroy, IAizikovich, AMirilashvili, SGrynszpan, F Sulfonamide derivatives with therapeutic indications US Patent  US9422235 Publication Date 8/23/2016 
Target
Name:
Cannabinoid receptor 2
Synonyms:
CANNABINOID CB2 CB2 CB2B CNR2_HUMAN Cannabinoid CB2 receptor Cannabinoid receptor 2 (CB2R) | hCB2
Type:
G Protein-Coupled Receptor (GPCR)
Mol. Mass.:
39690.94
Organism:
Homo sapiens (Human)
Description:
P34972
Residue:
360
  
Inhibitor
Name:
BDBM242492
Synonyms:
US9422235, 73
Type:
Small organic molecule
Emp. Form.:
C16H15ClF3N3O2S
Mol. Mass.:
405.822
SMILES:
FC(F)(F)c1cc(Nc2cccnc2Cl)ccc1S(=O)(=O)NCC1CC1
: