Target
Cannabinoid receptor 2
Ligand
BDBM242522
Substrate
Meas. Tech.
Binding Assay
Temperature
303.15±n/a K
Ki
114±n/a nM
IC50
187±n/a nM
Comments
extracted
Citation
 Yacovan, AAlroy, IAizikovich, AMirilashvili, SGrynszpan, F Sulfonamide derivatives with therapeutic indications US Patent  US9422235 Publication Date 8/23/2016 
Target
Name:
Cannabinoid receptor 2
Synonyms:
CANNABINOID CB2 CB2 CB2B CNR2_HUMAN Cannabinoid CB2 receptor Cannabinoid receptor 2 (CB2R) | hCB2
Type:
G Protein-Coupled Receptor (GPCR)
Mol. Mass.:
39690.94
Organism:
Homo sapiens (Human)
Description:
P34972
Residue:
360
  
Inhibitor
Name:
BDBM242522
Synonyms:
US9422235, 107
Type:
Small organic molecule
Emp. Form.:
C18H26F3N3O2S
Mol. Mass.:
405.478
SMILES:
CC(C)(NS(=O)(=O)c1ccc(NN2CCCCC2)cc1C(F)(F)F)C1CC1
: