Target
Beta-secretase 1
Ligand
BDBM242921
Substrate
Meas. Tech.
HTRF FRET Assay
pH
5±n/a
Temperature
303.15±n/a K
Ki
21±n/a nM
Comments
extracted
Citation
 Khan, TAScott, JDCumming, JN S-imino-S-oxo-iminothiazine compounds as BACE inhibitors, compositions, and their use US Patent  US9422255 Publication Date 8/23/2016 
Target
Name:
Beta-secretase 1
Synonyms:
ASP2 Aspartyl protease 2 BACE1 Beta-secretase (BACE) Beta-secretase 1 (BACE 1) Beta-secretase 1 (BACE1) Beta-site amyloid precursor protein cleaving enzyme 1 Memapsin-2 beta-Secretase (BACE-1) | beta-Secretase (BACE1)
Type:
Protein
Mol. Mass.:
55755.10
Organism:
Homo sapiens (Human)
Description:
P56817
Residue:
501
  
Inhibitor
Name:
BDBM242921
Synonyms:
US9422255, 2b
Type:
Small organic molecule
Emp. Form.:
C20H25F2N5O2S
Mol. Mass.:
437.507
SMILES:
CN[S@]1(O)C[C@](C)(NC(=N)C1(C)C)c1cc(NC(=O)c2ccc(F)cn2)ccc1F
: