Target
Carboxylic ester hydrolase
Ligand
BDBM243023
Substrate
Meas. Tech.
Enzymatic Assay
IC50
>100000±n/a nM
Citation
 Yurttas, LKaplancikli, ZAÖzkay, Y Design, synthesis and evaluation of new thiazole-piperazines as acetylcholinesterase inhibitors. J Enzyme Inhib Med Chem 28:1040-7 (2013)  
Target
Name:
Carboxylic ester hydrolase
Synonyms:
BuChE Butyrylcholine esterase Butyrylcholinesterase (BChE) Butyrylcholinesterase (EqBuChE) butyrylcholinesterase precursor
Type:
Protein
Mol. Mass.:
68842.83
Organism:
Equus caballus (Horse)
Description:
Q9N1N9
Residue:
602
  
Inhibitor
Name:
BDBM243023
Synonyms:
2-(4-Methylpiperazine-1-yl)-N-[4-(2-methylthiazol-4-yl)phenyl]acetamide (5a)
Type:
Small organic molecule
Emp. Form.:
C17H22N4OS
Mol. Mass.:
330.448
SMILES:
CN1CCN(CC(=O)Nc2ccc(cc2)-c2csc(C)n2)CC1
: