Target
Carboxylic ester hydrolase
Ligand
BDBM243027
Substrate
Meas. Tech.
Enzymatic Assay
IC50
>100000±n/a nM
Citation
 Yurttas, LKaplancikli, ZAÖzkay, Y Design, synthesis and evaluation of new thiazole-piperazines as acetylcholinesterase inhibitors. J Enzyme Inhib Med Chem 28:1040-7 (2013)  
Target
Name:
Carboxylic ester hydrolase
Synonyms:
BuChE Butyrylcholine esterase Butyrylcholinesterase (BChE) Butyrylcholinesterase (EqBuChE) butyrylcholinesterase precursor
Type:
Protein
Mol. Mass.:
68842.83
Organism:
Equus caballus (Horse)
Description:
Q9N1N9
Residue:
602
  
Inhibitor
Name:
BDBM243027
Synonyms:
2-[4-(4-Methylphenyl)piperazine-1-yl]-N-[4-(2-methylthiazol-4-yl)phenyl]acetamide (5e)
Type:
Small organic molecule
Emp. Form.:
C23H26N4OS
Mol. Mass.:
406.544
SMILES:
Cc1nc(cs1)-c1ccc(NC(=O)CN2CCN(CC2)c2ccc(C)cc2)cc1
: