Target
Carboxylic ester hydrolase
Ligand
BDBM243036
Substrate
Meas. Tech.
Enzymatic Assay
IC50
>100000±n/a nM
Citation
 Yurttas, LKaplancikli, ZAÖzkay, Y Design, synthesis and evaluation of new thiazole-piperazines as acetylcholinesterase inhibitors. J Enzyme Inhib Med Chem 28:1040-7 (2013)  
Target
Name:
Carboxylic ester hydrolase
Synonyms:
BuChE Butyrylcholine esterase Butyrylcholinesterase (BChE) Butyrylcholinesterase (EqBuChE) butyrylcholinesterase precursor
Type:
Protein
Mol. Mass.:
68842.83
Organism:
Equus caballus (Horse)
Description:
Q9N1N9
Residue:
602
  
Inhibitor
Name:
BDBM243036
Synonyms:
2-[4-(2-Pyridyl)piperazine-1-yl]-N-[4-(2-methylthiazol-4-yl)phenyl]acetamide (5n)
Type:
Small organic molecule
Emp. Form.:
C21H23N5OS
Mol. Mass.:
393.505
SMILES:
Cc1nc(cs1)-c1ccc(NC(=O)CN2CCN(CC2)c2ccccn2)cc1
: