Target
Acetylcholinesterase
Ligand
BDBM243025
Substrate
Meas. Tech.
Enzymatic Assay
pH
8±0.1
Temperature
298.15±0 K
IC50
6.34e+3± 1.31e+3 nM
Citation
 Yurttas, LKaplancikli, ZAÖzkay, Y Design, synthesis and evaluation of new thiazole-piperazines as acetylcholinesterase inhibitors. J Enzyme Inhib Med Chem 28:1040-7 (2013)  
Target
Name:
Acetylcholinesterase
Synonyms:
ACES_ELEEL Acetylcholinesterase (EeAChE) | ache
Type:
Enzyme
Mol. Mass.:
71812.79
Organism:
Electrophorus electricus (Electric eel)
Description:
Residue:
633
  
Inhibitor
Name:
BDBM243025
Synonyms:
2-(4-Cyclohexylpiperazine-1-yl)-N-[4-(2-methylthiazol-4-yl)pheny])acetamide (5c)
Type:
Small organic molecule
Emp. Form.:
C22H30N4OS
Mol. Mass.:
398.565
SMILES:
Cc1nc(cs1)-c1ccc(NC(=O)CN2CCN(CC2)C2CCCCC2)cc1
: