Target
Acetylcholinesterase
Ligand
BDBM243029
Substrate
Meas. Tech.
Enzymatic Assay
pH
8±0.1
Temperature
298.15±0 K
IC50
>1.00e+5±n/a nM
Citation
 Yurttas, LKaplancikli, ZAÖzkay, Y Design, synthesis and evaluation of new thiazole-piperazines as acetylcholinesterase inhibitors. J Enzyme Inhib Med Chem 28:1040-7 (2013)  
Target
Name:
Acetylcholinesterase
Synonyms:
ACES_ELEEL Acetylcholinesterase (EeAChE) | ache
Type:
Enzyme
Mol. Mass.:
71812.79
Organism:
Electrophorus electricus (Electric eel)
Description:
Residue:
633
  
Inhibitor
Name:
BDBM243029
Synonyms:
2-[4-(4-Chlorophenyl) piperazine-1-yl]-N-[4-(2-methylthiazol-4-yl)phenyl]acetamide (5g)
Type:
Small organic molecule
Emp. Form.:
C22H23ClN4OS
Mol. Mass.:
426.962
SMILES:
Cc1nc(cs1)-c1ccc(NC(=O)CN2CCN(CC2)c2ccc(Cl)cc2)cc1
: