Target
Acetylcholinesterase
Ligand
BDBM243036
Substrate
Meas. Tech.
Enzymatic Assay
pH
8±0.1
Temperature
298.15±0 K
IC50
51± 2 nM
Citation
 Yurttas, LKaplancikli, ZAÖzkay, Y Design, synthesis and evaluation of new thiazole-piperazines as acetylcholinesterase inhibitors. J Enzyme Inhib Med Chem 28:1040-7 (2013)  
Target
Name:
Acetylcholinesterase
Synonyms:
ACES_ELEEL Acetylcholinesterase (EeAChE) | ache
Type:
Enzyme
Mol. Mass.:
71812.79
Organism:
Electrophorus electricus (Electric eel)
Description:
Residue:
633
  
Inhibitor
Name:
BDBM243036
Synonyms:
2-[4-(2-Pyridyl)piperazine-1-yl]-N-[4-(2-methylthiazol-4-yl)phenyl]acetamide (5n)
Type:
Small organic molecule
Emp. Form.:
C21H23N5OS
Mol. Mass.:
393.505
SMILES:
Cc1nc(cs1)-c1ccc(NC(=O)CN2CCN(CC2)c2ccccn2)cc1
: