Target
Alpha-glucosidase MAL12
Ligand
BDBM50337364
Substrate
Meas. Tech.
α-glucosidase Inhibitory Activity Assay
pH
7±n/a
Temperature
298.15±n/a K
IC50
>3.00e+5±n/a nM
Comments
extracted
Citation
 Kashima, YYamaki, HSuzuki, TMiyazawa, M Structure-activity relationships of bergenin derivatives effect on a-glucosidase inhibition. J Enzyme Inhib Med Chem 28:1162-70 (2013)  
Target
Name:
Alpha-glucosidase MAL12
Synonyms:
α-Glucosidase MAL12_YEAST Maltase | alpha-Glucosidase (α-Glucosidase)
Type:
Protein
Mol. Mass.:
68084.32
Organism:
Saccharomyces cerevisiae
Description:
P53341
Residue:
584
  
Inhibitor
Name:
BDBM50337364
Synonyms:
3-methoxy-4-hydroxybenzoic acid 4-hydroxy-3-methoxybenzoic acid CHEMBL120568 Vanillic acid (M2)
Type:
Small organic molecule
Emp. Form.:
C8H8O4
Mol. Mass.:
168.1467
SMILES:
COc1cc(ccc1O)C(O)=O
: