Target
Androgen receptor
Ligand
BDBM245150
Substrate
Meas. Tech.
Transactivation Assay
Temperature
310.15±n/a K
IC50
740±n/a nM
Comments
extracted
Citation
 Nguyen, DKünzer, HFaus Gimenez, HBader, BKöhr, SFritsch, M N-[4-(quinolin-4-yloxy)cyclohexyl(methyl)](hetero)arylcarboxamides as androgen receptor antagonists, production and use thereof as medicinal products US Patent  US9428460 Publication Date 8/30/2016 
Target
Name:
Androgen receptor
Synonyms:
ANDR_HUMAN Androgen Receptor Androgen receptor/Baculoviral IAP repeat-containing protein 2 Dihydrotestosterone receptor Nuclear receptor subfamily 3 group C member 4
Type:
Receptor
Mol. Mass.:
99185.27
Organism:
Homo sapiens (Human)
Description:
CHO cells were stably transfected with human AR gene.
Residue:
920
  
Inhibitor
Name:
BDBM245150
Synonyms:
US9428460, 6
Type:
Small organic molecule
Emp. Form.:
C20H20FN3O3
Mol. Mass.:
369.3895
SMILES:
Fc1cccc2c(O[C@H]3CC[C@H](CNC(=O)c4ccon4)CC3)ccnc12
: