Target
Androgen receptor
Ligand
BDBM245154
Substrate
Meas. Tech.
Transactivation Assay
Temperature
310.15±n/a K
IC50
194±n/a nM
Comments
extracted
Citation
 Nguyen, DKünzer, HFaus Gimenez, HBader, BKöhr, SFritsch, M N-[4-(quinolin-4-yloxy)cyclohexyl(methyl)](hetero)arylcarboxamides as androgen receptor antagonists, production and use thereof as medicinal products US Patent  US9428460 Publication Date 8/30/2016 
Target
Name:
Androgen receptor
Synonyms:
ANDR_HUMAN Androgen Receptor Androgen receptor/Baculoviral IAP repeat-containing protein 2 Dihydrotestosterone receptor Nuclear receptor subfamily 3 group C member 4
Type:
Receptor
Mol. Mass.:
99185.27
Organism:
Homo sapiens (Human)
Description:
CHO cells were stably transfected with human AR gene.
Residue:
920
  
Inhibitor
Name:
BDBM245154
Synonyms:
US9428460, 10
Type:
Small organic molecule
Emp. Form.:
C23H23FN2O2
Mol. Mass.:
378.4393
SMILES:
Fc1cccc(c1)C(=O)NC[C@H]1CC[C@@H](CC1)Oc1ccnc2ccccc12
: