Target
Androgen receptor
Ligand
BDBM245163
Substrate
Meas. Tech.
Transactivation Assay
Temperature
310.15±n/a K
IC50
32±n/a nM
Comments
extracted
Citation
 Nguyen, DKünzer, HFaus Gimenez, HBader, BKöhr, SFritsch, M N-[4-(quinolin-4-yloxy)cyclohexyl(methyl)](hetero)arylcarboxamides as androgen receptor antagonists, production and use thereof as medicinal products US Patent  US9428460 Publication Date 8/30/2016 
Target
Name:
Androgen receptor
Synonyms:
ANDR_HUMAN Androgen Receptor Androgen receptor/Baculoviral IAP repeat-containing protein 2 Dihydrotestosterone receptor Nuclear receptor subfamily 3 group C member 4
Type:
Receptor
Mol. Mass.:
99185.27
Organism:
Homo sapiens (Human)
Description:
CHO cells were stably transfected with human AR gene.
Residue:
920
  
Inhibitor
Name:
BDBM245163
Synonyms:
US9428460, 19
Type:
Small organic molecule
Emp. Form.:
C22H21FN2O2
Mol. Mass.:
364.4127
SMILES:
Fc1cccc(c1)C(=O)N[C@H]1CC[C@@H](CC1)Oc1ccnc2ccccc12
: