Target
Androgen receptor [E709Y]
Ligand
BDBM245167
Substrate
Meas. Tech.
Transactivation Assay
Temperature
310.15±n/a K
IC50
9±n/a nM
Comments
extracted
Citation
 Nguyen, DKünzer, HFaus Gimenez, HBader, BKöhr, SFritsch, M N-[4-(quinolin-4-yloxy)cyclohexyl(methyl)](hetero)arylcarboxamides as androgen receptor antagonists, production and use thereof as medicinal products US Patent  US9428460 Publication Date 8/30/2016 
Target
Name:
Androgen receptor [E709Y]
Synonyms:
ANDR_HUMAN Androgen receptor (E709Y) NR3C4
Type:
Enzyme
Mol. Mass.:
99220.34
Organism:
Homo sapiens (Human)
Description:
Entry Version 159, Sequence Version 2 (P10275)
Residue:
920
  
Inhibitor
Name:
BDBM245167
Synonyms:
US9428460, 23
Type:
Small organic molecule
Emp. Form.:
C23H20FN3O2
Mol. Mass.:
389.4222
SMILES:
Fc1cccc(c1)C(=O)N[C@H]1CC[C@@H](CC1)Oc1ccnc2c(cccc12)C#N
: