Target
Beta-secretase 1
Ligand
BDBM244051
Substrate
Meas. Tech.
HTRF FRET Assay
pH
5±n/a
Temperature
303.15±n/a K
Ki
2±n/a nM
Comments
extracted
Citation
 Khan, TAScott, JDCumming, JN S-imino-S-oxo-iminothiadiazine compounds as BACE inhibitors, compositions, and their use US Patent  US9428476 Publication Date 8/30/2016 
Target
Name:
Beta-secretase 1
Synonyms:
ASP2 Aspartyl protease 2 BACE1 Beta-secretase (BACE) Beta-secretase 1 (BACE 1) Beta-secretase 1 (BACE1) Beta-site amyloid precursor protein cleaving enzyme 1 Memapsin-2 beta-Secretase (BACE-1) | beta-Secretase (BACE1)
Type:
Protein
Mol. Mass.:
55755.10
Organism:
Homo sapiens (Human)
Description:
P56817
Residue:
501
  
Inhibitor
Name:
BDBM244051
Synonyms:
US9428476, 4b
Type:
Small organic molecule
Emp. Form.:
C18H22F2N6O2S
Mol. Mass.:
424.468
SMILES:
CN[S@]1(O)C[C@](C)(NC(=N)N1C)c1cc(NC(=O)c2ccc(F)cn2)ccc1F
: