Target
Focal adhesion kinase 1
Ligand
BDBM245597
Substrate
Meas. Tech.
Biochemical Assay
IC50
<20±n/a nM
Citation
 Xiao, DCheng, LLiu, XHu, YXu, XLiu, ZZhang, LWu, WWang, SShen, YLi, GWang, YZhao, SLi, CTang, JYu, H 2,4-diamino-6,7-dihydro-5H-pyrrolo[2,3]pyrimidine derivatives as FAK/Pyk2 inhibitors US Patent  US9428508 Publication Date 8/30/2016 
Target
Name:
Focal adhesion kinase 1
Synonyms:
FADK 1 FAK1 FLT4 Focal adhesion kinase (FAK) Focal adhesion kinase 1 (FAK) Focal adhesion kinase-related nonkinase PTK2 Protein-tyrosine kinase 2 p125FAK | pp125FAK
Type:
Tyrosine-protein kinase
Mol. Mass.:
119233.17
Organism:
Homo sapiens (Human)
Description:
Q05397
Residue:
1052
  
Inhibitor
Name:
BDBM245597
Synonyms:
US9428508, 52
Type:
Small organic molecule
Emp. Form.:
C25H31N7O3S
Mol. Mass.:
509.624
SMILES:
CC(C)NS(=O)(=O)c1ccccc1Nc1nc(Nc2ccc(cc2)N2CCOCC2)nc2NCCc12
: