Target
Protein-tyrosine kinase 2-beta
Ligand
BDBM245695
Substrate
Meas. Tech.
Biochemical Assay
IC50
<20±n/a nM
Citation
 Xiao, DCheng, LLiu, XHu, YXu, XLiu, ZZhang, LWu, WWang, SShen, YLi, GWang, YZhao, SLi, CTang, JYu, H 2,4-diamino-6,7-dihydro-5H-pyrrolo[2,3]pyrimidine derivatives as FAK/Pyk2 inhibitors US Patent  US9428508 Publication Date 8/30/2016 
Target
Name:
Protein-tyrosine kinase 2-beta
Synonyms:
FAK2 PTK2B PTK2B protein tyrosine kinase 2 beta (PTK2B) Protein tyrosine kinase 2 beta | RAFTK
Type:
Protein
Mol. Mass.:
115868.80
Organism:
Homo sapiens (Human)
Description:
Q14289
Residue:
1009
  
Inhibitor
Name:
BDBM245695
Synonyms:
US9428508, 150
Type:
Small organic molecule
Emp. Form.:
C29H35N7O4S
Mol. Mass.:
577.698
SMILES:
COc1cc(ccc1Nc1nc2NCC3(CC3)c2c(Nc2ccccc2S(=O)(=O)NC2CCC2)n1)N1CCOCC1
: