Target
Tyrosine-protein kinase BTK
Ligand
BDBM246416
Substrate
Meas. Tech.
LANCE-TR-FRET Assay
IC50
740±n/a nM
Citation
 Kim, RMLiu, JWu, HLiu, SYang, CZheng, S BTK inhibitors US Patent  US9446130 Publication Date 9/20/2016 
Target
Name:
Tyrosine-protein kinase BTK
Synonyms:
AGMX1 Agammaglobulinaemia tyrosine kinase B cell progenitor kinase BPK BTK_HUMAN Tyrosine Kinase BTK Tyrosine-protein kinase BTK (BTK)
Type:
Enzyme
Mol. Mass.:
76289.95
Organism:
Homo sapiens (Human)
Description:
Q06187
Residue:
659
  
Inhibitor
Name:
BDBM246416
Synonyms:
US9446130, 24
Type:
Small organic molecule
Emp. Form.:
C27H23F3N8O
Mol. Mass.:
532.5197
SMILES:
Cn1ncc2[C@H](CCCc12)c1nc(-c2ccc(cc2)C(=O)Nc2cc(ccn2)C(F)(F)F)c2c(N)nccn12
: