Target
Carbonic anhydrase 9
Ligand
BDBM50334349
Substrate
Meas. Tech.
CO2 Hydration Assay
Ki
0.9±0.0 nM
Citation
 Pan, JLau, JMesak, FHundal, NPourghiasian, MLiu, ZBénard, FDedhar, SSupuran, CTLin, KS Synthesis and evaluation of 18F-labeled carbonic anhydrase IX inhibitors for imaging with positron emission tomography. J Enzyme Inhib Med Chem 29:249-55 (2014)  
Target
Name:
Carbonic anhydrase 9
Synonyms:
CA-IX CAH9_HUMAN Carbonic anhydrase 9 (CA IX) Carbonic anhydrase 9 precursor Carbonic anhydrase IX (CAIX) Carbonic anhydrases; II & IX MN RCC-associated antigen G250
Type:
Enzyme
Mol. Mass.:
49669.03
Organism:
Homo sapiens (Human)
Description:
Catalytic domain of human cloned isozyme was used in the assay
Residue:
459
  
Inhibitor
Name:
BDBM50334349
Synonyms:
4-(3-(3-nitrophenyl)ureido)benzenesulfonamide 4-{[(3-nitrophenyl)carbamoyl]amino}benzenesulfonamide CHEMBL1614844
Type:
Small organic molecule
Emp. Form.:
C13H12N4O5S
Mol. Mass.:
336.323
SMILES:
NS(=O)(=O)c1ccc(NC(=O)Nc2cccc(c2)[N+]([O-])=O)cc1
: