Target
Genome polyprotein [2420-3010]
Ligand
BDBM249199
Substrate
Meas. Tech.
Inhibition Assay
pH
7.3±n/a
Temperature
298.15±n/a K
IC50
930±n/a nM
Comments
extracted
Citation
 Girijavallabhan, VBogen, SPan, WDang, QDavies, I 2′-disubstituted nucleoside derivatives and methods of use thereof for the treatment of viral diseases US Patent  US9457039 Publication Date 10/4/2016 
Target
Name:
Genome polyprotein [2420-3010]
Synonyms:
POLG_HCVBK | RNA-directed RNA polymerase (NS5B)
Type:
Enzyme
Mol. Mass.:
65648.71
Organism:
Hepatitis C virus genotype 1b (isolate BK) (HCV)
Description:
aa 2420-3010
Residue:
591
  
Inhibitor
Name:
BDBM249199
Synonyms:
US9457039, 22
Type:
Small organic molecule
Emp. Form.:
C11H13N8O12P3
Mol. Mass.:
542.1908
SMILES:
C[C@@]1(N=[N+]=[N-])[C@H](O)[C@@H](COP([O-])(=O)OP([O-])(=O)OP([O-])([O-])=O)O[C@H]1c1cnc2c(N)ncnn12
: