Target
Alpha-carbonic anhydrase
Ligand
BDBM26995
Substrate
Meas. Tech.
ChEMBL_158306 (CHEMBL763191)
pH
7.5±n/a
Temperature
293.15±n/a K
Ki
73000±n/a nM
Citation
 Del Prete, SVullo, DDe Luca, VCarginale, Vdi Fonzo, POsman, SMAlOthman, ZSupuran, CTCapasso, C Anion inhibition profiles of a-, ß- and ¿-carbonic anhydrases from the pathogenic bacterium Vibrio cholerae. Bioorg Med Chem 24:3413-7 (2016)  
Target
Name:
Alpha-carbonic anhydrase
Synonyms:
hpαCA
Type:
Protein
Mol. Mass.:
28337.60
Organism:
Helicobacter pylori (strain G27)
Description:
B5Z8I0
Residue:
247
  
Inhibitor
Name:
BDBM26995
Synonyms:
CHEMBL355001 sulfamamide sulfamoylamine
Type:
Emp. Form.:
H4N2O2S
Mol. Mass.:
96.109
SMILES:
NS(N)(=O)=O
: