Target
Substance-K receptor
Ligand
BDBM251913
Substrate
Meas. Tech.
Binding Assay
pH
7.4±n/a
Temperature
298.15±n/a K
Ki
>10000±n/a nM
Comments
extracted
Citation
 Hoveyda, HRDutheuil, GFraser, GLRoy, MEl Bousmaqui, MBatt, F Chiral N-acyl-5,6,7(8-substituted)-tetrahydro-[1,2,4]triazolo[4,3-a]pyrazines as selective NK-3 receptor antagonists, pharmaceutical composition, methods for use in NK-3 receptor mediated disorders and chiral synthesis thereof US Patent  US9475814 Publication Date 10/25/2016 
Target
Name:
Substance-K receptor
Synonyms:
NK-2 receptor NK2R NKNAR Neurokinin A receptor Neurokinin-2 (NK-2) SKR TACR2 Tachykinin receptor 2 (NK2) | hnk-3
Type:
Protein
Mol. Mass.:
44455.78
Organism:
Homo sapiens (Human)
Description:
P21452
Residue:
398
  
Inhibitor
Name:
BDBM251913
Synonyms:
US10065961, Compound 11 US10941151, Compound 11 | US9475814, 11
Type:
Small organic molecule
Emp. Form.:
C21H19N5O2S
Mol. Mass.:
405.473
SMILES:
C[C@H]1N(CCn2c1nnc2-c1coc(C)n1)C(=O)c1ccc(cc1)-c1cccs1
: