Target
Nicotinamide phosphoribosyltransferase
Ligand
BDBM252437
Substrate
Meas. Tech.
Biochemical Inhibition Assay
pH
7.5±n/a
IC50
108±n/a nM
Comments
extracted
Citation
 Bair, KWBaumeister, TRDragovich, PGosselin, FYuen, PZak, MZheng, X Pyridinyl and pyrimidinyl sulfoxide and sulfone derivatives US Patent  US9458172 Publication Date 10/4/2016 
Target
Name:
Nicotinamide phosphoribosyltransferase
Synonyms:
NAMPT NAmPRTase Nicotinamide phosphoribosyltransferase (NAMPT) PBEF1 | Pre-B-cell colony-enhancing factor 1
Type:
Enzyme
Mol. Mass.:
55524.98
Organism:
Homo sapiens (Human)
Description:
P43490
Residue:
491
  
Inhibitor
Name:
BDBM252437
Synonyms:
US9458172, 6
Type:
Small organic molecule
Emp. Form.:
C18H14N6O3S
Mol. Mass.:
394.407
SMILES:
O=C(NCc1ncc(cn1)S(=O)(=O)c1ccccc1)c1cnc2[nH]ncc2c1
: