Target
Cholesteryl ester transfer protein
Ligand
BDBM254059
Substrate
Meas. Tech.
Cholesteryl Ester Transfer Assay
IC50
24.3±n/a nM
Citation
 Lee, JKOh, JTLee, JWLee, SHKim, ILee, JYBae, SYLee, SRKim, YT Biaryl- or heterocyclic biaryl-substituted cyclohexene derivative compounds as CETP inhibitors US Patent  US9493430 Publication Date 11/15/2016 
Target
Name:
Cholesteryl ester transfer protein
Synonyms:
CETP Cholesteryl ester transfer protein (CETP) | Lipid transfer protein I
Type:
Enzyme
Mol. Mass.:
54751.53
Organism:
Homo sapiens (Human)
Description:
P11597
Residue:
493
  
Inhibitor
Name:
BDBM254059
Synonyms:
US9493430, 689
Type:
Small organic molecule
Emp. Form.:
C36H35F6NO5
Mol. Mass.:
675.6572
SMILES:
COc1cc(cc(c1)-c1ccc(cc1C)C(O)=O)C1=C(CN2[C@@H](C)[C@H](OC2=O)c2cc(cc(c2)C(F)(F)F)C(F)(F)F)CC(C)(C)CC1
: