Target
Aldo-keto reductase family 1 member C3/Glutathione S-transferase P
Ligand
BDBM254835
Substrate
Meas. Tech.
Inhibitory Activity Assay
pH
7±n/a
IC50
4.2±n/a nM
Comments
extracted
Citation
 Bothe, UBarak, NBusemann, MFischer, OMRotgeri, AGashaw, IHartung, IMarquardt, T Estra-1,3,5(10),16-tetraene-3-carboxamide derivatives, processes for their preparation, pharmaceutical preparations comprising them and their use for preparing medicaments US Patent  US9487554 Publication Date 11/8/2016 
Target
Name:
Aldo-keto reductase family 1 member C3/Glutathione S-transferase P
Synonyms:
GST-Aldo-keto reductase family 1 member C3 (AKR1C3)
Type:
Enzyme
Mol. Mass.:
Description:
Components:
This complex has 2 components.
Component 1
Name:
Glutathione S-transferase P
Synonyms:
FAEES3 GST3 GSTP1-1 Glutathione S-transferase Glutathione S-transferase P Glutathione transferase (GST)
Type:
Enzyme
Mol. Mass.:
23353.53
Organism:
Homo sapiens (Human)
Description:
P09211
Residue:
210
  
Component 2
Name:
Aldo-keto reductase family 1 member C3
Synonyms:
17-beta-Hydroxysteroid Dehydrogenase 5 (17-beta-HSD5, AKR1C3) AK1C3_HUMAN Aldo-keto reductase family 1 member C3 Aldo-keto reductase family 1 member C3 (AK1C3a) Aldo-keto-reductase family 1 member C3 Dihydrodiol dehydrogenase 3 Estradiol 17-beta-dehydrogenase KIAA0119 Prostaglandin F synthase Trans-1,2-dihydrobenzene-1,2-diol dehydrogenase
Type:
Enzyme
Mol. Mass.:
36859.86
Organism:
Homo sapiens (Human)
Description:
P42330
Residue:
323
  
Inhibitor
Name:
BDBM254835
Synonyms:
US9487554, 22
Type:
Small organic molecule
Emp. Form.:
C29H31F3N2O3
Mol. Mass.:
512.5632
SMILES:
CN(CCC(O)=O)C(=O)c1ccc2[C@H]3CC[C@@]4(C)[C@@H](CC=C4c4cncc(c4)C(F)(F)F)[C@@H]3CCc2c1
: