Target
Tyrosine-protein kinase JAK1
Ligand
BDBM254987
Substrate
Meas. Tech.
Enzyme Assay
IC50
1.8±n/a nM
Citation
 Takahashi, KWatanabe, THayashi, KKurihara, KNakamura, TYamamoto, ANishimura, TKamiyama, THidaka, Y Tricyclic pyrrolopyridine compound, and JAK inhibitor US Patent  US9475813 Publication Date 10/25/2016 
Target
Name:
Tyrosine-protein kinase JAK1
Synonyms:
JAK-1 JAK1A JAK1_HUMAN Janus kinase 1 (JAK1) | Janus kinase 1 JAK1
Type:
Protein
Mol. Mass.:
133293.73
Organism:
Homo sapiens (Human)
Description:
P23458
Residue:
1154
  
Inhibitor
Name:
BDBM254987
Synonyms:
US9475813, 43
Type:
Small organic molecule
Emp. Form.:
C20H27N5O3S
Mol. Mass.:
417.525
SMILES:
CS(=O)(=O)NC[C@H]1CC[C@@H](CC1)N1CN(C2CC2)C(=O)c2cnc3[nH]ccc3c12
: