Target
Casein kinase I isoform epsilon
Ligand
BDBM255090
Substrate
Meas. Tech.
Kinase Assay
pH
7.4±n/a
Temperature
298.15±n/a K
IC50
19.9±n/a nM
Comments
extracted
Citation
 Velaparthi, UDarne, CPDodd, DSLiu, PMussari, CPWittman, MDKumaravel, SMullick, D Pyrazole substituted imidazopyrazines as casein kinase 1 d/e inhibitors US Patent  US9475817 Publication Date 10/25/2016 
Target
Name:
Casein kinase I isoform epsilon
Synonyms:
Axin-1/Casein kinase I epsilon CKIe Casein kinase 1 epsilon (CK1Ɛ) Casein kinase I isoform epsilon (CK1 epsilon) Casein kinase I isoform epsilon (CK1epsilon) | KC1E_HUMAN
Type:
Protein
Mol. Mass.:
47340.25
Organism:
Homo sapiens (Human)
Description:
P49674
Residue:
416
  
Inhibitor
Name:
BDBM255090
Synonyms:
US9475817, 47
Type:
Small organic molecule
Emp. Form.:
C23H15ClF2N6O
Mol. Mass.:
464.855
SMILES:
Cn1cc(c(n1)-c1ccc(F)cc1)-c1ccc2nc(NC(=O)c3cc(Cl)ccc3F)cn2n1
: