Target
chymase
Ligand
BDBM255944
Substrate
Meas. Tech.
Enzymatic Chymase Assay
pH
7.5±n/a
IC50
2±n/a nM
Comments
extracted
Citation
 Fürstner, CAckerstaff, JStraub, AMeier, HTinel, HZimmermann, KTersteegen, AZubov, DKast, RSchamberger, JSchäfer, MBörngen, K Bicyclically substituted uracils and the use thereof US Patent  US9481672 Publication Date 11/1/2016 
Target
Name:
chymase
Synonyms:
Type:
Enzyme
Mol. Mass.:
27507.42
Organism:
Mesocricetus auratus (Golden hamster)
Description:
A0A1U7QTH6
Residue:
247
  
Inhibitor
Name:
BDBM255944
Synonyms:
US9481672, 122
Type:
Small organic molecule
Emp. Form.:
C23H16F6N4O5
Mol. Mass.:
542.3874
SMILES:
Cn1c2ccc(cc2n(C)c1=O)-n1cc(C(O)=O)c(=O)n(Cc2cccc(c2C(F)(F)F)C(F)(F)F)c1=O
: