Target
Orexin receptor type 2
Ligand
BDBM256879
Substrate
Meas. Tech.
Fluorescent Imaging Plate Reader (FLIPR) Assay
Temperature
310.15±n/a K
IC50
7600±n/a nM
Comments
extracted
Citation
 Fieldhouse, CGlen, ARobinson, JSFujimoto, T Cyclopentylbenzamide derivatives and their use for the treatment of psychotic and cognitive disorders US Patent  US9493432 Publication Date 11/15/2016 
Target
Name:
Orexin receptor type 2
Synonyms:
HCRTR2 OX2R_HUMAN Orexin receptor type 2 (OR-2) Orexin receptor type 2 (OX2R) Ox-2-R | Ox2-R
Type:
Protein
Mol. Mass.:
50710.53
Organism:
Homo sapiens (Human)
Description:
O43614
Residue:
444
  
Inhibitor
Name:
BDBM256879
Synonyms:
US9493432, 3
Type:
Small organic molecule
Emp. Form.:
C21H22FN3O3S
Mol. Mass.:
415.481
SMILES:
COc1cccc(OC)c1C(=O)N[C@H]1CCC[C@@H]1Nc1nc2ccc(F)cc2s1
: