Target
Orexin receptor type 2
Ligand
BDBM257881
Substrate
Meas. Tech.
In Vitro Assay
Temperature
310.15±n/a K
IC50
2±n/a nM
Comments
extracted
Citation
 Bolli, MBoss, CBrotschi, CGude, MHeidmann, BSifferlen, TWilliams, JT Orexin receptor antagonists which are [ortho bi-(hetero-)aryl]-[2-(meta bi-(hetero-)aryl)-pyrrolidin-1-yl]-methanone derivatives US Patent  US9493446 Publication Date 11/15/2016 
Target
Name:
Orexin receptor type 2
Synonyms:
HCRTR2 OX2R_HUMAN Orexin receptor type 2 (OR-2) Orexin receptor type 2 (OX2R) Ox-2-R | Ox2-R
Type:
Protein
Mol. Mass.:
50710.53
Organism:
Homo sapiens (Human)
Description:
O43614
Residue:
444
  
Inhibitor
Name:
BDBM257881
Synonyms:
US9493446, 350
Type:
Small organic molecule
Emp. Form.:
C24H23ClN6O4
Mol. Mass.:
494.93
SMILES:
COc1cc(C(=O)N2CCC[C@H]2c2noc(n2)-c2cc(C)ccc2OC)c(cc1Cl)-n1nccn1
: