Target
Orexin receptor type 2
Ligand
BDBM257909
Substrate
Meas. Tech.
In Vitro Assay
Temperature
310.15±n/a K
IC50
2±n/a nM
Comments
extracted
Citation
 Bolli, MBoss, CBrotschi, CGude, MHeidmann, BSifferlen, TWilliams, JT Orexin receptor antagonists which are [ortho bi-(hetero-)aryl]-[2-(meta bi-(hetero-)aryl)-pyrrolidin-1-yl]-methanone derivatives US Patent  US9493446 Publication Date 11/15/2016 
Target
Name:
Orexin receptor type 2
Synonyms:
HCRTR2 OX2R_HUMAN Orexin receptor type 2 (OR-2) Orexin receptor type 2 (OX2R) Ox-2-R | Ox2-R
Type:
Protein
Mol. Mass.:
50710.53
Organism:
Homo sapiens (Human)
Description:
O43614
Residue:
444
  
Inhibitor
Name:
BDBM257909
Synonyms:
US9493446, 378
Type:
Small organic molecule
Emp. Form.:
C22H18ClFN6O3
Mol. Mass.:
468.868
SMILES:
COc1c(F)cccc1-c1nc(no1)[C@@H]1CCCN1C(=O)c1ccc(Cl)cc1-n1nccn1
: