Target
Orexin receptor type 2
Ligand
BDBM258060
Substrate
Meas. Tech.
In Vitro Assay
Temperature
310.15±n/a K
IC50
2±n/a nM
Comments
extracted
Citation
 Bolli, MBoss, CBrotschi, CGude, MHeidmann, BSifferlen, TWilliams, JT Orexin receptor antagonists which are [ortho bi-(hetero-)aryl]-[2-(meta bi-(hetero-)aryl)-pyrrolidin-1-yl]-methanone derivatives US Patent  US9493446 Publication Date 11/15/2016 
Target
Name:
Orexin receptor type 2
Synonyms:
HCRTR2 OX2R_HUMAN Orexin receptor type 2 (OR-2) Orexin receptor type 2 (OX2R) Ox-2-R | Ox2-R
Type:
Protein
Mol. Mass.:
50710.53
Organism:
Homo sapiens (Human)
Description:
O43614
Residue:
444
  
Inhibitor
Name:
BDBM258060
Synonyms:
US9493446, 529
Type:
Small organic molecule
Emp. Form.:
C24H21F3N6O2
Mol. Mass.:
482.4577
SMILES:
Cc1ccc(c(c1)C(=O)N1CCC[C@H]1c1ncc([nH]1)-c1ccccc1OC(F)(F)F)-n1nccn1
: